Target
Sphingosine kinase 1
Ligand
BDBM50443388
Substrate
Meas. Tech.
ChEMBL_1890503 (CHEMBL4392257)
Ki
12000±n/a nM
Citation
 Adams, DRTawati, SBerretta, GRivas, PLBaiget, JJiang, ZAlsfouk, AMackay, SPPyne, NJPyne, S Topographical Mapping of Isoform-Selectivity Determinants for J-Channel-Binding Inhibitors of Sphingosine Kinases 1 and 2. J Med Chem 62:3658-3676 (2019)  
Target
Name:
Sphingosine kinase 1
Synonyms:
SK1 SPHK1 SPK Sphingosine kinase 1 (SPHK1) | Sphingosine kinase types 1 (SphK1)
Type:
Enzyme
Mol. Mass.:
42521.16
Organism:
Homo sapiens (Human)
Description:
Q9NYA1
Residue:
384
  
Inhibitor
Name:
BDBM50443388
Synonyms:
CHEMBL3086782 | US9688668, SLR080811
Type:
Small organic molecule
Emp. Form.:
C21H31N5O
Mol. Mass.:
369.5037
SMILES:
CCCCCCCCc1ccc(cc1)-c1noc(n1)[C@@H]1CCCN1C(N)=N
: