Target
Sphingosine kinase 1
Ligand
BDBM50312869
Substrate
Meas. Tech.
ChEMBL_1890506 (CHEMBL4392260)
Ki
16000±n/a nM
Citation
 Adams, DRTawati, SBerretta, GRivas, PLBaiget, JJiang, ZAlsfouk, AMackay, SPPyne, NJPyne, S Topographical Mapping of Isoform-Selectivity Determinants for J-Channel-Binding Inhibitors of Sphingosine Kinases 1 and 2. J Med Chem 62:3658-3676 (2019)  
Target
Name:
Sphingosine kinase 1
Synonyms:
SK1 SPHK1 SPK Sphingosine kinase 1 (SPHK1) | Sphingosine kinase types 1 (SphK1)
Type:
Enzyme
Mol. Mass.:
42521.16
Organism:
Homo sapiens (Human)
Description:
Q9NYA1
Residue:
384
  
Inhibitor
Name:
BDBM50312869
Synonyms:
4-(4-(4-chlorophenyl)thiazol-2-ylamino)phenol N-aryl-4-aryl-1,3-thiazole-2-amine, 5
Type:
Small organic molecule
Emp. Form.:
C15H11ClN2OS
Mol. Mass.:
302.779
SMILES:
Oc1ccc(Nc2nc(cs2)-c2ccc(Cl)cc2)cc1
: