Target
Sphingosine kinase 2
Ligand
BDBM50312869
Substrate
Meas. Tech.
ChEMBL_1890507 (CHEMBL4392261)
Ki
6700±n/a nM
Citation
 Adams, DRTawati, SBerretta, GRivas, PLBaiget, JJiang, ZAlsfouk, AMackay, SPPyne, NJPyne, S Topographical Mapping of Isoform-Selectivity Determinants for J-Channel-Binding Inhibitors of Sphingosine Kinases 1 and 2. J Med Chem 62:3658-3676 (2019)  
Target
Name:
Sphingosine kinase 2
Synonyms:
SK 2 SPHK2 SPK 2 Sphingosine kinase types 2 (SphK2)
Type:
Protein
Mol. Mass.:
69221.44
Organism:
Homo sapiens (Human)
Description:
Q9NRA0
Residue:
654
  
Inhibitor
Name:
BDBM50312869
Synonyms:
4-(4-(4-chlorophenyl)thiazol-2-ylamino)phenol N-aryl-4-aryl-1,3-thiazole-2-amine, 5
Type:
Small organic molecule
Emp. Form.:
C15H11ClN2OS
Mol. Mass.:
302.779
SMILES:
Oc1ccc(Nc2nc(cs2)-c2ccc(Cl)cc2)cc1
: