Target
Sphingosine kinase 2
Ligand
BDBM50017016
Substrate
Meas. Tech.
ChEMBL_1890502 (CHEMBL4392256)
Ki
6400±n/a nM
Citation
 Adams, DRTawati, SBerretta, GRivas, PLBaiget, JJiang, ZAlsfouk, AMackay, SPPyne, NJPyne, S Topographical Mapping of Isoform-Selectivity Determinants for J-Channel-Binding Inhibitors of Sphingosine Kinases 1 and 2. J Med Chem 62:3658-3676 (2019)  
Target
Name:
Sphingosine kinase 2
Synonyms:
SK 2 SPHK2 SPK 2 Sphingosine kinase types 2 (SphK2)
Type:
Protein
Mol. Mass.:
69221.44
Organism:
Homo sapiens (Human)
Description:
Q9NRA0
Residue:
654
  
Inhibitor
Name:
BDBM50017016
Synonyms:
CHEMBL3287036
Type:
Small organic molecule
Emp. Form.:
C18H24N2O3S
Mol. Mass.:
348.46
SMILES:
CCCCOc1ccc(CC\C=C2/SC(=O)N(CCN)C2=O)cc1
: