Target
Dimer of Protein farnesyltransferase subunit beta
Ligand
BDBM50079085
Substrate
Meas. Tech.
ChEMBL_70454 (CHEMBL680087)
IC50
0.8±n/a nM
Citation
 Taveras, AGDeskus, JChao, JVaccaro, CJNjoroge, FGVibulbhan, BPinto, PRemiszewski, Sdel Rosario, JDoll, RJAlvarez, CLalwani, TMallams, AKRossman, RRAfonso, AGirijavallabhan, VMGanguly, AKPramanik, BHeimark, LBishop, WRWang, LKirschmeier, PJames, LCarr, DLiu, M Identification of pharmacokinetically stable 3, 10-dibromo-8-chlorobenzocycloheptapyridine farnesyl protein transferase inhibitors with potent enzyme and cellular activities. J Med Chem 42:2651-61 (1999)  
Target
Name:
Dimer of Protein farnesyltransferase subunit beta
Synonyms:
Protein Farnesyltransferase (PFT) Chain B
Type:
Mol. Mass.:
Description:
ASSAY_ID of EBI is 51428
Components:
This complex has 3 components.
Component 1
Name:
Protein farnesyltransferase subunit beta
Synonyms:
CAAX farnesyltransferase subunit alpha FNTB FTase-alpha GGTase-I-alpha Protein farnesyl/geranylgeranyl transferase Protein farnesyltransferase subunit beta Protein farnesyltransferase/geranylgeranyltransferase type-1 subunit alpha Ras proteins prenyltransferase subunit beta | Type I protein geranyl-geranyltransferase subunit alpha
Type:
Enzyme Subunit
Mol. Mass.:
48766.02
Organism:
Homo sapiens (Human)
Description:
Protein farnesyltransferase subunit beta
Residue:
437
  
Component 2
Name:
Protein farnesyltransferase subunit beta
Synonyms:
CAAX farnesyltransferase subunit alpha FNTB FTase-alpha GGTase-I-alpha Protein farnesyl/geranylgeranyl transferase Protein farnesyltransferase subunit beta Protein farnesyltransferase/geranylgeranyltransferase type-1 subunit alpha Ras proteins prenyltransferase subunit beta | Type I protein geranyl-geranyltransferase subunit alpha
Type:
Enzyme Subunit
Mol. Mass.:
48766.02
Organism:
Homo sapiens (Human)
Description:
Protein farnesyltransferase subunit beta
Residue:
437
  
Inhibitor
Name:
BDBM50079085
Synonyms:
5-(4-{2-[4-((R)-3,10-Dibromo-8-chloro-6,11-dihydro-5H-benzo[5,6]cyclohepta[1,2-b]pyridin-11-yl)-piperidin-1-yl]-2-oxo-ethyl}-piperidine-1-carbonyl)-nicotinic acid | CHEMBL315402
Type:
Small organic molecule
Emp. Form.:
C33H33Br2ClN4O4
Mol. Mass.:
744.901
SMILES:
OC(=O)c1cncc(c1)C(=O)N1CCC(CC(=O)N2CCC(CC2)[C@H]2c3ncc(Br)cc3CCc3cc(Cl)cc(Br)c23)CC1
: