Target
Tyrosinase
Ligand
BDBM50241354
Substrate
Meas. Tech.
ChEMBL_1891820 (CHEMBL4393647)
IC50
>50000±n/a nM
Citation
 Sugimoto, SYamano, YDesoukey, SYKatakawa, KWanas, ASOtsuka, HMatsunami, K Isolation of Sesquiterpene-Amino Acid Conjugates, Onopornoids A-D, and a Flavonoid Glucoside from Onopordum alexandrinum. J Nat Prod 82:1471-1477 (2019)  
Target
Name:
Tyrosinase
Synonyms:
LB24-AB SK29-AB TYRO_HUMAN | Tumor rejection antigen AB
Type:
Protein
Mol. Mass.:
60388.08
Organism:
Homo sapiens (Human)
Description:
P14679
Residue:
529
  
Inhibitor
Name:
BDBM50241354
Synonyms:
2-(3,4-Dihydroxy-phenyl)-5,7-dihydroxy-3-(3,4,5-trihydroxy-6-hydroxymethyl-tetrahydro-pyran-2-yloxy)-chromen-4-one 2-(3,4-dihydroxyphenyl)-5,7-dihydroxy-3-((2S,3R,4S,5S,6R)-3,4,5-trihydroxy-6-(hydroxymethyl)-tetrahydro-2H-pyran-2-yloxy)-4H-chromen-4-one 3,3',4',5,7-pentahydroxyflavone-3-beta-O-glucoside CHEMBL250450 Hyperoside Quercetin 3-O-beta-D-glucoside Quercetin-3-glucoside cid_5378597 hydroside isoquercetrin quercetin 3-O-beta-D-galactopyranoside quercetin 3-O-galactoside quercetin 3-O-glucoside | quercetin-3-galactoside
Type:
Small organic molecule
Emp. Form.:
C21H20O12
Mol. Mass.:
464.3763
SMILES:
OC[C@H]1O[C@@H](Oc2c(O)c3c(cc(O)cc3=O)oc2-c2ccc(O)c(O)c2)[C@H](O)[C@@H](O)[C@@H]1O
: