Target
Acetylcholine receptor subunit epsilon
Ligand
BDBM50524698
Substrate
Meas. Tech.
ChEMBL_1894505 (CHEMBL4396426)
IC50
20600±n/a nM
Citation
 Huang, WLiang, MLi, QZheng, XZhang, CWang, QTang, LZhang, ZWang, BShen, Z Development of the "hidden" multifunctional agents for Alzheimer's disease. Eur J Med Chem 177:247-258 (2019)  
Target
Name:
Acetylcholine receptor subunit epsilon
Synonyms:
ACHE_RAT Achre | Chrne
Type:
PROTEIN
Mol. Mass.:
54930.09
Organism:
Rattus norvegicus
Description:
ChEMBL_1292388
Residue:
494
  
Inhibitor
Name:
BDBM50524698
Synonyms:
CHEMBL4452986
Type:
Small organic molecule
Emp. Form.:
C19H25N3O2
Mol. Mass.:
327.4207
SMILES:
CC(N(C)C)c1cc(OC(=O)N2CCCCC2)c2ncccc2c1
: