Target
Neutrophil elastase
Ligand
BDBM50524817
Substrate
Meas. Tech.
ChEMBL_1894881 (CHEMBL4396802)
IC50
680±n/a nM
Citation
 Agbowuro, AAHwang, JPeel, EMazraani, RSpringwald, AMarsh, JWMcCaughey, LGamble, ABHuston, WMTyndall, JDA Structure-activity analysis of peptidic Chlamydia HtrA inhibitors. Bioorg Med Chem 27:4185-4199 (2019)  
Target
Name:
Neutrophil elastase
Synonyms:
Bone marrow serine protease Coagulation factor X ELANE Elastase HLE Leukocyte elastase Medullasin Neutrophil elastase (HNE) PMN elastase Trypsin
Type:
Enzyme
Mol. Mass.:
28532.38
Organism:
Homo sapiens (Human)
Description:
P08246
Residue:
267
  
Inhibitor
Name:
BDBM50524817
Synonyms:
CHEMBL4583962
Type:
Small organic molecule
Emp. Form.:
C32H46N3O7P
Mol. Mass.:
615.6973
SMILES:
CC(C)C(NC(=O)[C@@H]1CCCN1C(=O)[C@@H](NC(=O)OC(C)(C)C)C(C)(C)C)P(=O)(Oc1ccccc1)Oc1ccccc1
: