Target
Trypsin
Ligand
BDBM50524827
Substrate
Meas. Tech.
ChEMBL_1894882 (CHEMBL4396803)
IC50
>500000±n/a nM
Citation
 Agbowuro, AAHwang, JPeel, EMazraani, RSpringwald, AMarsh, JWMcCaughey, LGamble, ABHuston, WMTyndall, JDA Structure-activity analysis of peptidic Chlamydia HtrA inhibitors. Bioorg Med Chem 27:4185-4199 (2019)  
Target
Name:
Trypsin
Synonyms:
Serine protease 1/Trypsin-2/Trypsin-3
Type:
Mol. Mass.:
Description:
ASSAY_ID of ChEMBL is 2155713
Components:
This complex has 3 components.
Component 1
Name:
Serine protease 1
Synonyms:
Alpha-trypsin chain 1 Beta-trypsin PRSS1 TRP1 TRY1_HUMAN Thrombin & trypsin Trypsin I | Trypsin-1
Type:
Enzyme
Mol. Mass.:
26557.80
Organism:
Homo sapiens (Human)
Description:
P07477
Residue:
247
  
Component 2
Name:
Trypsin-2
Synonyms:
Anionic trypsinogen Serine protease 2 TRY2_HUMAN Thrombin & trypsin Trypsin II | Trypsin-2
Type:
PROTEIN
Mol. Mass.:
26479.43
Organism:
Homo sapiens (Human)
Description:
ChEMBL_41517
Residue:
247
  
Component 3
Name:
Trypsin-3
Synonyms:
Brain trypsinogen PRSS3 Serine protease 3 TRY3 TRY4 Trypsin Trypsin IV | Trypsin-3
Type:
PROTEIN
Mol. Mass.:
32532.52
Organism:
Homo sapiens (Human)
Description:
ChEMBL_216043
Residue:
304
  
Inhibitor
Name:
BDBM50524827
Synonyms:
CHEMBL4528358
Type:
Small organic molecule
Emp. Form.:
C24H39N3O6
Mol. Mass.:
465.583
SMILES:
CC(C)[C@H](NC(=O)OC(C)(C)C)C(=O)N1CCC[C@H]1C(=O)NC(C(C)C)C(=O)C(=O)C1CC1
: