Target
D(3) dopamine receptor
Ligand
BDBM21398
Substrate
Meas. Tech.
ChEMBL_1895325 (CHEMBL4397360)
IC50
0.250000±n/a nM
Citation
 Reilly, SWRiad, AAHsieh, CJSahlholm, KJacome, DAGriffin, STaylor, MWeng, CCXu, KKirschner, NLuedtke, RRParry, CMalhotra, SKaranicolas, JMach, RH Leveraging a Low-Affinity Diazaspiro Orthosteric Fragment to Reduce Dopamine D J Med Chem 62:5132-5147 (2019)  
Target
Name:
D(3) dopamine receptor
Synonyms:
DOPAMINE D3 DRD3_HUMAN Dopamine D3 receptor (D3) Dopamine receptor Dopamine receptor D3
Type:
Mol. Mass.:
44243.43
Organism:
Homo sapiens (Human)
Description:
Residue:
400
  
Inhibitor
Name:
BDBM21398
Synonyms:
4-[4-(4-Chloro-phenyl)-4-hydroxy-piperidin-1-yl]-1-(4-fluoro-phenyl)-butan-1-one;propionate(HCl) CHEMBL54 Haloperidol | Haloperidol, 1
Type:
Small organic molecule
Emp. Form.:
C21H23ClFNO2
Mol. Mass.:
375.864
SMILES:
OC1(CCN(CCCC(=O)c2ccc(F)cc2)CC1)c1ccc(Cl)cc1
: