Target
Beta-1 adrenergic receptor
Ligand
BDBM25771
Substrate
Meas. Tech.
ChEMBL_1895520 (CHEMBL4397555)
Ki
550±n/a nM
Citation
 Stanek, MPicard, LPSchmidt, MFKaindl, JMHübner, HBouvier, MWeikert, DGmeiner, P Hybridization of ?-Adrenergic Agonists and Antagonists Confers G Protein Bias. J Med Chem 62:5111-5131 (2019)  
Target
Name:
Beta-1 adrenergic receptor
Synonyms:
ADRB1_MOUSE Adrb1r Beta-1 adrenergic receptor Beta-1 adrenoreceptor
Type:
PROTEIN
Mol. Mass.:
50507.75
Organism:
Mus musculus
Description:
ChEMBL_105090
Residue:
466
  
Inhibitor
Name:
BDBM25771
Synonyms:
1-hydroxy-2-naphthoic acid;4-[1-hydroxy-2-[6-(4-phenylbutoxy)hexylamino]ethyl]-2-methylol-phenol Aeromax Serevent | salmeterol xinafoate
Type:
Small organic molecule
Emp. Form.:
C25H37NO4
Mol. Mass.:
415.5656
SMILES:
OCc1cc(ccc1O)C(O)CNCCCCCCOCCCCc1ccccc1
: