Target
Steryl-sulfatase
Ligand
BDBM10019
Substrate
Meas. Tech.
ChEMBL_1896402 (CHEMBL4398437)
IC50
20±n/a nM
Citation
 Saha, TMakar, SSwetha, RGutti, GSingh, SK Estrogen signaling: An emanating therapeutic target for breast cancer treatment. Eur J Med Chem 177:116-143 (2019)  
Target
Name:
Steryl-sulfatase
Synonyms:
ARSC1 Arylsulfatase C STS_HUMAN Steryl-sulfate sulfohydrolase
Type:
Enzyme
Mol. Mass.:
65503.66
Organism:
Homo sapiens (Human)
Description:
P08842
Residue:
583
  
Inhibitor
Name:
BDBM10019
Synonyms:
(2-chloro-4-{[(4-cyanophenyl)(4H-1,2,4-triazol-4-yl)amino]methyl}phenyl) sulfamate YM511-based dual aromatase-sulfatase inhibitor (DASI) 6 | dual aromatase-sulfatase inhibitor 6
Type:
Small organic molecule
Emp. Form.:
C16H13ClN6O3S
Mol. Mass.:
404.831
SMILES:
NS(=O)(=O)Oc1ccc(CN(c2ccc(cc2)C#N)n2cnnc2)cc1Cl
: