Target
Scytalone dehydratase
Ligand
BDBM50080936
Substrate
Meas. Tech.
ChEMBL_199521 (CHEMBL802495)
Ki
0.049000±n/a nM
Citation
 Jennings, LDWawrzak, ZAmorose, DSchwartz, RSJordan, DB A new potent inhibitor of fungal melanin biosynthesis identified through combinatorial chemistry. Bioorg Med Chem Lett 9:2509-14 (1999)  
Target
Name:
Scytalone dehydratase
Synonyms:
SCYD_MAGO7 Scytalone dehydratase
Type:
PROTEIN
Mol. Mass.:
20248.63
Organism:
Magnaporthe grisea
Description:
ChEMBL_199536
Residue:
172
  
Inhibitor
Name:
BDBM50080936
Synonyms:
3-Chloro-3-methyl-1-trifluoromethyl-cyclobutanecarboxylic acid [(R)-1-(4-bromo-phenyl)-ethyl]-amide | CHEMBL432940
Type:
Small organic molecule
Emp. Form.:
C15H16BrClF3NO
Mol. Mass.:
398.646
SMILES:
C[C@@H](NC(=O)C1(CC(C)(Cl)C1)C(F)(F)F)c1ccc(Br)cc1
: