Target
Dimer of Protein farnesyltransferase subunit beta
Ligand
BDBM50081215
Substrate
Meas. Tech.
ChEMBL_70302 (CHEMBL677849)
IC50
0.18±n/a nM
Citation
 Williams, TMBergman, JMBrashear, KBreslin, MJDinsmore, CJHutchinson, JHMacTough, SCStump, CAWei, DDZartman, CBBogusky, MJCulberson, JCBuser-Doepner, CDavide, JGreenberg, IBHamilton, KAKoblan, KSKohl, NELiu, DLobell, RBMosser, SDO'Neill, TJRands, ESchaber, MDHuff, JR N-arylpiperazinone inhibitors of farnesyltransferase: discovery and biological activity. J Med Chem 42:3779-84 (1999)  
Target
Name:
Dimer of Protein farnesyltransferase subunit beta
Synonyms:
Protein Farnesyltransferase (PFT) Chain B
Type:
Mol. Mass.:
Description:
ASSAY_ID of EBI is 51428
Components:
This complex has 3 components.
Component 1
Name:
Protein farnesyltransferase subunit beta
Synonyms:
CAAX farnesyltransferase subunit alpha FNTB FTase-alpha GGTase-I-alpha Protein farnesyl/geranylgeranyl transferase Protein farnesyltransferase subunit beta Protein farnesyltransferase/geranylgeranyltransferase type-1 subunit alpha Ras proteins prenyltransferase subunit beta | Type I protein geranyl-geranyltransferase subunit alpha
Type:
Enzyme Subunit
Mol. Mass.:
48766.02
Organism:
Homo sapiens (Human)
Description:
Protein farnesyltransferase subunit beta
Residue:
437
  
Component 2
Name:
Protein farnesyltransferase subunit beta
Synonyms:
CAAX farnesyltransferase subunit alpha FNTB FTase-alpha GGTase-I-alpha Protein farnesyl/geranylgeranyl transferase Protein farnesyltransferase subunit beta Protein farnesyltransferase/geranylgeranyltransferase type-1 subunit alpha Ras proteins prenyltransferase subunit beta | Type I protein geranyl-geranyltransferase subunit alpha
Type:
Enzyme Subunit
Mol. Mass.:
48766.02
Organism:
Homo sapiens (Human)
Description:
Protein farnesyltransferase subunit beta
Residue:
437
  
Inhibitor
Name:
BDBM50081215
Synonyms:
4-{5-[(S)-4-(3-Chloro-phenyl)-2-ethanesulfonylmethyl-5-oxo-piperazin-1-ylmethyl]-imidazol-1-ylmethyl}-benzonitrile | CHEMBL125558
Type:
Small organic molecule
Emp. Form.:
C25H26ClN5O3S
Mol. Mass.:
512.024
SMILES:
CCS(=O)(=O)C[C@@H]1CN(C(=O)CN1Cc1cncn1Cc1ccc(cc1)C#N)c1cccc(Cl)c1
: