Target
Retinoic acid receptor gamma
Ligand
BDBM50526315
Substrate
Meas. Tech.
ChEMBL_1899800 (CHEMBL4401915)
EC50
7.6±n/a nM
Citation
 Goncalves, MBClarke, EJarvis, CIBarret Kalindjian, SPitcher, TGrist, JHobbs, CCarlstedt, TJack, JBrown, JTMills, MMumford, PBorthwick, ADCorcoran, JPT Discovery and lead optimisation of a potent, selective and orally bioavailable RAR? agonist for the potential treatment of nerve injury. Bioorg Med Chem Lett 29:995-1000 (2019)  
Target
Name:
Retinoic acid receptor gamma
Synonyms:
Nr1b3 Rarg
Type:
PROTEIN
Mol. Mass.:
50896.02
Organism:
Mus musculus
Description:
ChEMBL_196161
Residue:
458
  
Inhibitor
Name:
BDBM50526315
Synonyms:
CHEMBL4439399 | US10752616, Code No. BHBA-019
Type:
Small organic molecule
Emp. Form.:
C18H8F4N2O4
Mol. Mass.:
392.2607
SMILES:
OC(=O)c1ccc(cc1)-c1noc(n1)-c1cc2c(ccc(F)c2o1)C(F)(F)F
: