Target
Retinoic acid receptor gamma
Ligand
BDBM50526322
Substrate
Meas. Tech.
ChEMBL_1899800 (CHEMBL4401915)
EC50
5.4±n/a nM
Citation
 Goncalves, MBClarke, EJarvis, CIBarret Kalindjian, SPitcher, TGrist, JHobbs, CCarlstedt, TJack, JBrown, JTMills, MMumford, PBorthwick, ADCorcoran, JPT Discovery and lead optimisation of a potent, selective and orally bioavailable RAR? agonist for the potential treatment of nerve injury. Bioorg Med Chem Lett 29:995-1000 (2019)  
Target
Name:
Retinoic acid receptor gamma
Synonyms:
Nr1b3 Rarg
Type:
PROTEIN
Mol. Mass.:
50896.02
Organism:
Mus musculus
Description:
ChEMBL_196161
Residue:
458
  
Inhibitor
Name:
BDBM50526322
Synonyms:
CHEMBL4442948
Type:
Small organic molecule
Emp. Form.:
C17H12Cl2N2O4
Mol. Mass.:
379.194
SMILES:
CCOc1c(Cl)cc(cc1Cl)-c1noc(n1)-c1ccc(cc1)C(O)=O
: