Target
Bile salt-activated lipase
Ligand
BDBM50081700
Substrate
Meas. Tech.
ChEMBL_48915 (CHEMBL660745)
Ki
25±n/a nM
Citation
 Deck, LMBaca, MLSalas, SLHunsaker, LAVander Jagt, DL 3-Alkyl-6-chloro-2-pyrones: selective inhibitors of pancreatic cholesterol esterase. J Med Chem 42:4250-6 (1999)  
Target
Name:
Bile salt-activated lipase
Synonyms:
BAL CEL_HUMAN | Cholesterol esterase
Type:
PROTEIN
Mol. Mass.:
79308.99
Organism:
Homo sapiens (Human)
Description:
ChEMBL_512655
Residue:
753
  
Inhibitor
Name:
BDBM50081700
Synonyms:
6-Chloro-3-(2-cyclohexyl-ethyl)-pyran-2-one | CHEMBL134339
Type:
Small organic molecule
Emp. Form.:
C13H17ClO2
Mol. Mass.:
240.726
SMILES:
Clc1ccc(CCC2CCCCC2)c(=O)o1
: