Target
Phenylethanolamine N-methyltransferase
Ligand
BDBM50077541
Substrate
Meas. Tech.
ChEMBL_152399 (CHEMBL764115)
Ki
240±n/a nM
Citation
 Grunewald, GLCaldwell, TMLi, QDahanukar, VHMcNeil, BCriscione, KR Enantiospecific synthesis of 3-fluoromethyl-, 3-hydroxymethyl-, and 3-chloromethyl-1,2,3,4-tetrahydroisoquinolines as selective inhibitors of phenylethanolamine N-methyltransferase versus the alpha(2)-adrenoceptor. J Med Chem 42:4351-61 (1999)  
Target
Name:
Phenylethanolamine N-methyltransferase
Synonyms:
Noradrenaline N-methyltransferase PNMT_BOVIN | PNMTase
Type:
Enzyme
Mol. Mass.:
30916.97
Organism:
Bos taurus (bovine)
Description:
Residue:
283
  
Inhibitor
Name:
BDBM50077541
Synonyms:
((R)-7-Nitro-1,2,3,4-tetrahydro-isoquinolin-3-yl)-methanol [(3R)-7-NITRO-1,2,3,4-TETRAHYDROISOQUINOLIN-3-YL]METHANOL
Type:
Small organic molecule
Emp. Form.:
C10H12N2O3
Mol. Mass.:
208.2139
SMILES:
OC[C@H]1Cc2ccc(cc2CN1)[N+]([O-])=O
: