Target
Potassium voltage-gated channel subfamily KQT member 2
Ligand
BDBM50526877
Substrate
Meas. Tech.
ChEMBL_1901607 (CHEMBL4403829)
EC50
80±n/a nM
Citation
 Ostacolo, CMiceli, FDi Sarno, VNappi, PIraci, NSoldovieri, MVCiaglia, TAmbrosino, PVestuto, VLauritano, AMusella, SPepe, GBasilicata, MGManfra, MPerinelli, DRNovellino, EBertamino, AGomez-Monterrey, IMCampiglia, PTaglialatela, M Synthesis and Pharmacological Characterization of Conformationally Restricted Retigabine Analogues as Novel Neuronal Kv7 Channel Activators. J Med Chem 63:163-185 (2020)  
Target
Name:
Potassium voltage-gated channel subfamily KQT member 2
Synonyms:
KCNQ (Kv7) potassium channel KCNQ2_HUMAN Neuroblastoma-specific potassium channel subunit alpha KvLQT2 Voltage-gated potassium channel subunit Kv7.2
Type:
PROTEIN
Mol. Mass.:
95883.20
Organism:
Homo sapiens (Human)
Description:
ChEMBL_1457496
Residue:
872
  
Inhibitor
Name:
BDBM50526877
Synonyms:
CHEMBL4545892
Type:
Small organic molecule
Emp. Form.:
C23H25F3N2O
Mol. Mass.:
402.4526
SMILES:
CCCCCCC(=O)Nc1ccc2n(Cc3ccc(cc3)C(F)(F)F)ccc2c1
: