Target
Potassium voltage-gated channel subfamily KQT member 5
Ligand
BDBM50143558
Substrate
Meas. Tech.
ChEMBL_1901610 (CHEMBL4403832)
EC50
800±n/a nM
Citation
 Ostacolo, CMiceli, FDi Sarno, VNappi, PIraci, NSoldovieri, MVCiaglia, TAmbrosino, PVestuto, VLauritano, AMusella, SPepe, GBasilicata, MGManfra, MPerinelli, DRNovellino, EBertamino, AGomez-Monterrey, IMCampiglia, PTaglialatela, M Synthesis and Pharmacological Characterization of Conformationally Restricted Retigabine Analogues as Novel Neuronal Kv7 Channel Activators. J Med Chem 63:163-185 (2020)  
Target
Name:
Potassium voltage-gated channel subfamily KQT member 5
Synonyms:
KCNQ (Kv7) potassium channel KCNQ5_HUMAN | Voltage-gated potassium channel subunit Kv7.5
Type:
PROTEIN
Mol. Mass.:
102221.23
Organism:
Homo sapiens (Human)
Description:
ChEMBL_938650
Residue:
932
  
Inhibitor
Name:
BDBM50143558
Synonyms:
CHEMBL41355 N-(2-amino-4-(4-fluorobenzylamino)-phenyl)carbamic acid ethylester [2-Amino-4-(4-fluoro-benzylamino)-phenyl]-carbamic acid ethyl ester
Type:
Small organic molecule
Emp. Form.:
C16H18FN3O2
Mol. Mass.:
303.3314
SMILES:
CCOC(=O)Nc1ccc(NCc2ccc(F)cc2)cc1N
: