Target
Potassium voltage-gated channel subfamily KQT member 4
Ligand
BDBM50143558
Substrate
Meas. Tech.
ChEMBL_1901609 (CHEMBL4403831)
EC50
1980±n/a nM
Citation
 Ostacolo, CMiceli, FDi Sarno, VNappi, PIraci, NSoldovieri, MVCiaglia, TAmbrosino, PVestuto, VLauritano, AMusella, SPepe, GBasilicata, MGManfra, MPerinelli, DRNovellino, EBertamino, AGomez-Monterrey, IMCampiglia, PTaglialatela, M Synthesis and Pharmacological Characterization of Conformationally Restricted Retigabine Analogues as Novel Neuronal Kv7 Channel Activators. J Med Chem 63:163-185 (2020)  
Target
Name:
Potassium voltage-gated channel subfamily KQT member 4
Synonyms:
KCNQ (Kv7) potassium channel KCNQ4_HUMAN Potassium channel subunit alpha KvLQT4 Voltage-gated potassium channel subunit Kv7.4
Type:
PROTEIN
Mol. Mass.:
77131.10
Organism:
Homo sapiens (Human)
Description:
ChEMBL_1520985
Residue:
695
  
Inhibitor
Name:
BDBM50143558
Synonyms:
CHEMBL41355 N-(2-amino-4-(4-fluorobenzylamino)-phenyl)carbamic acid ethylester [2-Amino-4-(4-fluoro-benzylamino)-phenyl]-carbamic acid ethyl ester
Type:
Small organic molecule
Emp. Form.:
C16H18FN3O2
Mol. Mass.:
303.3314
SMILES:
CCOC(=O)Nc1ccc(NCc2ccc(F)cc2)cc1N
: