Target
Potassium voltage-gated channel subfamily KQT member 3
Ligand
BDBM50526877
Substrate
Meas. Tech.
ChEMBL_1901608 (CHEMBL4403830)
EC50
10500±n/a nM
Citation
 Ostacolo, CMiceli, FDi Sarno, VNappi, PIraci, NSoldovieri, MVCiaglia, TAmbrosino, PVestuto, VLauritano, AMusella, SPepe, GBasilicata, MGManfra, MPerinelli, DRNovellino, EBertamino, AGomez-Monterrey, IMCampiglia, PTaglialatela, M Synthesis and Pharmacological Characterization of Conformationally Restricted Retigabine Analogues as Novel Neuronal Kv7 Channel Activators. J Med Chem 63:163-185 (2020)  
Target
Name:
Potassium voltage-gated channel subfamily KQT member 3
Synonyms:
KCNQ (Kv7) potassium channel KCNQ3_HUMAN | Voltage-gated potassium channel subunit Kv7.3
Type:
PROTEIN
Mol. Mass.:
96759.41
Organism:
Homo sapiens (Human)
Description:
ChEMBL_938652
Residue:
872
  
Inhibitor
Name:
BDBM50526877
Synonyms:
CHEMBL4545892
Type:
Small organic molecule
Emp. Form.:
C23H25F3N2O
Mol. Mass.:
402.4526
SMILES:
CCCCCCC(=O)Nc1ccc2n(Cc3ccc(cc3)C(F)(F)F)ccc2c1
: