Target
Bromodomain-containing protein 4
Ligand
BDBM50526964
Substrate
Meas. Tech.
ChEMBL_1901796 (CHEMBL4404018)
Kd
5.0±n/a nM
Citation
 Wellaway, CRAmans, DBamborough, PBarnett, HBit, RABrown, JACarlson, NRChung, CWCooper, AWJCraggs, PDDavis, RPDean, TWEvans, JPGordon, LHarada, ILHirst, DJHumphreys, PGJones, KLLewis, AJLindon, MJLugo, DMahmood, MMcCleary, SMedeiros, PMitchell, DJO'Sullivan, MLe Gall, APatel, VKPatten, CPoole, DLShah, RRSmith, JEStafford, KAJThomas, PJVimal, MWall, IDWatson, RJWellaway, NYao, GPrinjha, RK Discovery of a Bromodomain and Extraterminal Inhibitor with a Low Predicted Human Dose through Synergistic Use of Encoded Library Technology and Fragment Screening. J Med Chem 63:714-746 (2020)  
Target
Name:
Bromodomain-containing protein 4
Synonyms:
BRD4 Bromodomain-containing protein 4 (BRD4) Protein HUNK1
Type:
Protein
Mol. Mass.:
152264.84
Organism:
Homo sapiens (Human)
Description:
O60885
Residue:
1362
  
Inhibitor
Name:
BDBM50526964
Synonyms:
CHEMBL4438171
Type:
Small organic molecule
Emp. Form.:
C23H30N4O4
Mol. Mass.:
426.5087
SMILES:
COCC(COC)n1c(nc2cc(ccc12)N1CCOCC1)-c1cc(C)c(=O)n(C)c1
: