Target
Histone acetyltransferase KAT6A [507-778]
Ligand
BDBM50527359
Substrate
Meas. Tech.
ChEMBL_1902530 (CHEMBL4404752)
IC50
32±n/a nM
Citation
 Priebbenow, DLLeaver, DJNguyen, NCleary, BLagiakos, HRSanchez, JXue, LHuang, FSun, YMujumdar, PMudududdla, RVarghese, STeguh, SCharman, SAWhite, KLShackleford, DMKatneni, KCuellar, MStrasser, JMDahlin, JLWalters, MAStreet, IPMonahan, BJJarman, KEJousset Sabroux, HFalk, HChung, MCHermans, SJDowner, NLParker, MWVoss, AKThomas, TBaell, JB Discovery of Acylsulfonohydrazide-Derived Inhibitors of the Lysine Acetyltransferase, KAT6A, as Potent Senescence-Inducing Anti-Cancer Agents. J Med Chem 63:4655-4684 (2020)  
Target
Name:
Histone acetyltransferase KAT6A [507-778]
Synonyms:
2.3.1.48 KAT6A MOZ MYST-3 Monocytic leukemia zinc finger protein Runt-related transcription factor-binding protein 2 Zinc finger protein 220
Type:
PROTEIN
Mol. Mass.:
224994.11
Organism:
Homo sapiens
Description:
Q92794[507-778]
Residue:
2004
  
Inhibitor
Name:
BDBM50527359
Synonyms:
CHEMBL4441001 | US10829446, Compound 80
Type:
Small organic molecule
Emp. Form.:
C17H14F2N4O3S
Mol. Mass.:
392.38
SMILES:
Cc1cnn(c1)-c1cc(F)cc(c1)C(=O)NNS(=O)(=O)c1ccccc1F
: