Target
Cytochrome P450 4F8
Ligand
BDBM50527962
Substrate
Meas. Tech.
ChEMBL_1904211 (CHEMBL4406433)
IC50
380000±n/a nM
Citation
 Kowalski, JPMcDonald, MGPelletier, RDHanenberg, HWiek, CRettie, AE Design and Characterization of the First Selective and Potent Mechanism-Based Inhibitor of Cytochrome P450 4Z1. J Med Chem 63:4824-4836 (2020)  
Target
Name:
Cytochrome P450 4F8
Synonyms:
1.14.14.1 CYP4F8 Cytochrome P450 4F8
Type:
PROTEIN
Mol. Mass.:
60009.05
Organism:
Homo sapiens
Description:
ChEMBL_119703
Residue:
520
  
Inhibitor
Name:
BDBM50527962
Synonyms:
CHEMBL4442292
Type:
Small organic molecule
Emp. Form.:
C12H16N4O2
Mol. Mass.:
248.281
SMILES:
OC(=O)CCCCCNn1nnc2ccccc12
: