Target
Proteinase-activated receptor 4
Ligand
BDBM50528295
Substrate
Meas. Tech.
ChEMBL_1904769 (CHEMBL4407127)
IC50
1.6±n/a nM
Citation
 Miller, MMBanville, JFriends, TJGagnon, MHangeland, JJLavallée, JFMartel, AO'Grady, HRémillard, RRuediger, ETremblay, FPosy, SLAllegretto, NJGuarino, VRHarden, DGHarper, TWHartl, KJosephs, JMalmstrom, SWatson, CYang, YZhang, GWong, PYang, JBouvier, MSeiffert, DAWexler, RRLawrence, RMPriestley, ESMarinier, A Discovery of Potent Protease-Activated Receptor 4 Antagonists with in Vivo Antithrombotic Efficacy. J Med Chem 62:7400-7416 (2019)  
Target
Name:
Proteinase-activated receptor 4
Synonyms:
Coagulation factor II receptor-like 3 PAR-4 PAR4_HUMAN Proteinase-activated receptor 4 (PAR4) | Thrombin receptor-like 3
Type:
Protein
Mol. Mass.:
41145.16
Organism:
Homo sapiens (Human)
Description:
Q96RI0
Residue:
385
  
Inhibitor
Name:
BDBM50528295
Synonyms:
CHEMBL4539616
Type:
Small organic molecule
Emp. Form.:
C22H19N3O5S
Mol. Mass.:
437.468
SMILES:
COc1nn2cc(nc2s1)-c1cc2c(OCc3ccc(OC)cc3)cc(OC)cc2o1
: