Target
Retinoic acid receptor gamma
Ligand
BDBM31883
Substrate
Meas. Tech.
ChEMBL_196178 (CHEMBL804951)
EC50
0.5±n/a nM
Citation
 Simoni, DInvidiata, FPRondanin, RGrimaudo, SCannizzo, GBarbusca, EPorretto, FD'Alessandro, NTolomeo, M Structure-activity relationship studies of novel heteroretinoids: induction of apoptosis in the HL-60 cell line by a novel isoxazole-containing heteroretinoid. J Med Chem 42:4961-9 (2000)  
Target
Name:
Retinoic acid receptor gamma
Synonyms:
NR1B3 RAR-gamma RARG_HUMAN Retinoic acid receptor gamma | Retinoid receptor
Type:
PROTEIN
Mol. Mass.:
50345.43
Organism:
Homo sapiens (Human)
Description:
ChEMBL_1458016
Residue:
454
  
Inhibitor
Name:
BDBM31883
Synonyms:
9-cis-retinoic acid (9cRA) AT-RA CHEMBL38 SMR000058245 Vitamin A acid [3H]Retinoic acid [3H]tretinoin cid_444795
Type:
radiolabeled ligand
Emp. Form.:
C20H28O2
Mol. Mass.:
300.4351
SMILES:
C\C(\C=C\C1=C(C)CCCC1(C)C)=C/C=C/C(/C)=C/C(O)=O
: