Target
Epithelial discoidin domain-containing receptor 1
Ligand
BDBM50528541
Substrate
Meas. Tech.
ChEMBL_1905316 (CHEMBL4407674)
Kd
5.9±n/a nM
Citation
 Zhu, DHuang, HPinkas, DMLuo, JGanguly, DFox, AEArner, EXiang, QTu, ZCBullock, ANBrekken, RADing, KLu, X 2-Amino-2,3-dihydro-1 J Med Chem 62:7431-7444 (2019)  
Target
Name:
Epithelial discoidin domain-containing receptor 1
Synonyms:
CAK DDR1_HUMAN Discoidin domain-containing receptor 1 (DDR1) EDDR1 Epithelial discoidin domain receptor 1 (DDR1) Epithelial discoidin domain-containing receptor 1 (DDR1) Mammary carcinoma kinase 10 NTRK4 Protein-tyrosine kinase RTK 6 TRKE | Tyrosine-protein kinase CAK
Type:
Tyrosine-protein kinase
Mol. Mass.:
101130.02
Organism:
Homo sapiens (Human)
Description:
Q08345
Residue:
913
  
Inhibitor
Name:
BDBM50528541
Synonyms:
CHEMBL4437631
Type:
Small organic molecule
Emp. Form.:
C26H23F3N6O
Mol. Mass.:
492.4956
SMILES:
CN([C@@H]1Cc2ccc(cc2C1)C(=O)Nc1cc(cc(c1)C(F)(F)F)-n1cnc(C)c1)c1cncnc1
: