Target
Melanin-concentrating hormone receptor 1
Ligand
BDBM50169377
Substrate
Meas. Tech.
ChEMBL_1908152 (CHEMBL4410510)
IC50
0.310000±n/a nM
Citation
 Helal, MAChittiboyina, AGAvery, MA Identification of a new small molecule chemotype of Melanin Concentrating Hormone Receptor-1 antagonists using pharmacophore-based virtual screening. Bioorg Med Chem Lett 29:0 (2019)  
Target
Name:
Melanin-concentrating hormone receptor 1
Synonyms:
G-protein coupled receptor 24 MCH receptor 1 MCH-R1 MCHR-1 MCHR1_HUMAN Melanin-Concentrating Hormone Receptor 1 (MCH1R) Melanin-concentrating hormone receptor 1 (MCH-1) Melanin-concentrating hormone receptor 1 (MCHR-1) SLC-1 Somatostatin receptor-like protein
Type:
G Protein-Coupled Receptor (GPCR)
Mol. Mass.:
45976.27
Organism:
Homo sapiens (Human)
Description:
Membranes from CHO-K1 cells stably expressing human MCH1R were used in assays.
Residue:
422
  
Inhibitor
Name:
BDBM50169377
Synonyms:
1-[4-(3'-Cyano-biphenyl-4-yl)-1-propyl-piperidin-4-ylmethyl]-3-(3,5-dichloro-phenyl)-urea | CHEMBL176159
Type:
Small organic molecule
Emp. Form.:
C29H30Cl2N4O
Mol. Mass.:
521.481
SMILES:
CCCN1CCC(CNC(=O)Nc2cc(Cl)cc(Cl)c2)(CC1)c1ccc(cc1)-c1cccc(c1)C#N
: