Target
DNA-(apurinic or apyrimidinic site) endonuclease
Ligand
BDBM50530043
Substrate
Meas. Tech.
ChEMBL_1911350 (CHEMBL4413796)
IC50
1800±n/a nM
Citation
 Trilles, RBeglov, DChen, QHe, HWireman, RReed, AChennamadhavuni, SPanek, JSBrown, LEVajda, SPorco, JAKelley, MRGeorgiadis, MM Discovery of Macrocyclic Inhibitors of Apurinic/Apyrimidinic Endonuclease 1. J Med Chem 62:1971-1988 (2019)  
Target
Name:
DNA-(apurinic or apyrimidinic site) endonuclease
Synonyms:
APE APEX APEX1_HUMAN Apurinic-apyrimidinic endonuclease 1 (APE-1) DNA-(apurinic or apyrimidinic site) lyase REF1
Type:
Protein
Mol. Mass.:
35560.12
Organism:
Homo sapiens (Human)
Description:
P27695
Residue:
318
  
Inhibitor
Name:
BDBM50530043
Synonyms:
CHEMBL4458126
Type:
Small organic molecule
Emp. Form.:
C35H35N3O7
Mol. Mass.:
609.6683
SMILES:
C[C@H]1\C=C\CC(=O)OCCC(Oc2ccc3OCOc3c2)C(=O)N[C@@H](Cc2c[nH]c3ccccc23)C(=O)N[C@H]1c1ccccc1
: