Target
Estrogen-related receptor gamma
Ligand
BDBM50530062
Substrate
Meas. Tech.
ChEMBL_1911359 (CHEMBL4413805)
IC50
27±n/a nM
Citation
 Kim, JSong, JJi, HDYoo, EKLee, JELee, SBOh, JMLee, SHwang, JSYoon, HKim, DSLee, SJJeong, MLee, SKim, KHChoi, HSLee, SWPark, KGLee, IKKim, SHHwang, HJeon, YHChin, JCho, SJ Discovery of Potent, Selective, and Orally Bioavailable Estrogen-Related Receptor-? Inverse Agonists To Restore the Sodium Iodide Symporter Function in Anaplastic Thyroid Cancer. J Med Chem 62:1837-1858 (2019)  
Target
Name:
Estrogen-related receptor gamma
Synonyms:
ERR gamma-2 ERR3_HUMAN ESRRG Estrogen-Related Receptor, gamma KIAA0832 Nuclear receptor subfamily 3 group B member 3
Type:
PROTEIN
Mol. Mass.:
51305.00
Organism:
Homo sapiens (Human)
Description:
ChEMBL_1501351
Residue:
458
  
Inhibitor
Name:
BDBM50530062
Synonyms:
CHEMBL4443694
Type:
Small organic molecule
Emp. Form.:
C28H34Cl2N2O
Mol. Mass.:
485.488
SMILES:
Cl.Cl.Cc1ccc(cc1)C(=C(/CCCO)c1ccccc1)\c1ccc(cc1)N1CCNCC1
: