Target
Estrogen-related receptor gamma
Ligand
BDBM50530060
Substrate
Meas. Tech.
ChEMBL_1911364 (CHEMBL4413810)
IC50
20±n/a nM
Citation
 Kim, JSong, JJi, HDYoo, EKLee, JELee, SBOh, JMLee, SHwang, JSYoon, HKim, DSLee, SJJeong, MLee, SKim, KHChoi, HSLee, SWPark, KGLee, IKKim, SHHwang, HJeon, YHChin, JCho, SJ Discovery of Potent, Selective, and Orally Bioavailable Estrogen-Related Receptor-? Inverse Agonists To Restore the Sodium Iodide Symporter Function in Anaplastic Thyroid Cancer. J Med Chem 62:1837-1858 (2019)  
Target
Name:
Estrogen-related receptor gamma
Synonyms:
ERR gamma-2 ERR3_HUMAN ESRRG Estrogen-Related Receptor, gamma KIAA0832 Nuclear receptor subfamily 3 group B member 3
Type:
PROTEIN
Mol. Mass.:
51305.00
Organism:
Homo sapiens (Human)
Description:
ChEMBL_1501351
Residue:
458
  
Inhibitor
Name:
BDBM50530060
Synonyms:
CHEMBL4451327
Type:
Small organic molecule
Emp. Form.:
C30H38Cl2N2O2
Mol. Mass.:
529.541
SMILES:
Cl.Cl.CC(C)N1CCN(CC1)c1ccc(cc1)C(=C(\CCCO)c1ccccc1)\c1cccc(O)c1
: