Target
Peroxisome proliferator-activated receptor alpha
Ligand
BDBM50530340
Substrate
Meas. Tech.
ChEMBL_1911884 (CHEMBL4414330)
EC50
5200±n/a nM
Citation
 Pollinger, JGellrich, LSchierle, SKilu, WSchmidt, JKalinowsky, LOhrndorf, JKaiser, AHeering, JProschak, EMerk, D Tuning Nuclear Receptor Selectivity of Wy14,643 towards Selective Retinoid X Receptor Modulation. J Med Chem 62:2112-2126 (2019)  
Target
Name:
Peroxisome proliferator-activated receptor alpha
Synonyms:
NR1C1 PPAR PPAR-alpha PPARA_HUMAN Peroxisome proliferator-activated receptor | Peroxisome proliferator-activated receptor alpha (PPAR alpha)
Type:
Enzyme
Mol. Mass.:
52222.08
Organism:
Homo sapiens (Human)
Description:
Q07869
Residue:
468
  
Inhibitor
Name:
BDBM50530340
Synonyms:
CHEMBL4459701
Type:
Small organic molecule
Emp. Form.:
C14H14BrN3O2S
Mol. Mass.:
368.249
SMILES:
Cc1cccc(Nc2cc(Br)nc(SCC(O)=O)n2)c1C
: