Target
Peroxisome proliferator-activated receptor gamma
Ligand
BDBM50273681
Substrate
Meas. Tech.
ChEMBL_1911892 (CHEMBL4414338)
EC50
3000±n/a nM
Citation
 Pollinger, JGellrich, LSchierle, SKilu, WSchmidt, JKalinowsky, LOhrndorf, JKaiser, AHeering, JProschak, EMerk, D Tuning Nuclear Receptor Selectivity of Wy14,643 towards Selective Retinoid X Receptor Modulation. J Med Chem 62:2112-2126 (2019)  
Target
Name:
Peroxisome proliferator-activated receptor gamma
Synonyms:
NR1C3 PPAR-gamma PPARG_HUMAN Peroxisome proliferator-activated receptor gamma (PPAR gamma) Peroxisome proliferator-activated receptor gamma (PPARĪ³) peroxisome proliferator-activated receptor gamma isoform 2
Type:
Nuclear Receptor
Mol. Mass.:
57613.46
Organism:
Homo sapiens (Human)
Description:
P37231
Residue:
505
  
Inhibitor
Name:
BDBM50273681
Synonyms:
2-(4-chloro-6-(2,3-dimethylphenylamino)pyrimidin-2-ylthio)hexanoic acid | CHEMBL459972
Type:
Small organic molecule
Emp. Form.:
C18H22ClN3O2S
Mol. Mass.:
379.904
SMILES:
CCCCC(Sc1nc(Cl)cc(Nc2cccc(C)c2C)n1)C(O)=O
: