Target
Prostaglandin D2 receptor
Ligand
BDBM50085909
Substrate
Meas. Tech.
ChEMBL_157788 (CHEMBL767847)
IC50
3100±n/a nM
Citation
 Wang, YWos, JADirr, MJSoper, DLdeLong, MAMieling, GEDe, BAmburgey, JSSuchanek, EGTaylor, CJ Design and synthesis of 13,14-dihydro prostaglandin F(1alpha) analogues as potent and selective ligands for the human FP receptor. J Med Chem 43:945-52 (2000)  
Target
Name:
Prostaglandin D2 receptor
Synonyms:
PD2R_HUMAN Prostaglandin D2 Prostanoid DP receptor
Type:
Enzyme
Mol. Mass.:
40288.87
Organism:
Homo sapiens (Human)
Description:
Q13258
Residue:
359
  
Inhibitor
Name:
BDBM50085909
Synonyms:
7-[3,5-Dihydroxy-2-(3-hydroxy-4-phenoxy-butyl)-cyclopentyl]-heptanoic acid | CHEMBL425681
Type:
Small organic molecule
Emp. Form.:
C22H34O6
Mol. Mass.:
394.5018
SMILES:
O[C@H](CC[C@H]1[C@H](O)C[C@H](O)[C@@H]1CCCCCCC(O)=O)COc1ccccc1
: