Target
Prostaglandin E2 receptor EP4 subtype
Ligand
BDBM50085914
Substrate
Meas. Tech.
ChEMBL_158329 (CHEMBL767812)
IC50
>10000±n/a nM
Citation
 Wang, YWos, JADirr, MJSoper, DLdeLong, MAMieling, GEDe, BAmburgey, JSSuchanek, EGTaylor, CJ Design and synthesis of 13,14-dihydro prostaglandin F(1alpha) analogues as potent and selective ligands for the human FP receptor. J Med Chem 43:945-52 (2000)  
Target
Name:
Prostaglandin E2 receptor EP4 subtype
Synonyms:
PE2R4_HUMAN PGE2 receptor EP4 subtype PTGER4 Prostanoid EP4 receptor
Type:
Enzyme
Mol. Mass.:
53134.53
Organism:
Homo sapiens (Human)
Description:
P35408
Residue:
488
  
Inhibitor
Name:
BDBM50085914
Synonyms:
7-[(1R,2R,3R,5S)-3,5-Dihydroxy-2-((S)-3-hydroxy-octyl)-cyclopentyl]-heptanoic acid CHEMBL36817
Type:
Small organic molecule
Emp. Form.:
C20H38O5
Mol. Mass.:
358.5127
SMILES:
CCCCC[C@H](O)CC[C@H]1[C@H](O)C[C@H](O)[C@@H]1CCCCCCC(O)=O
: