Target
Thromboxane A2 receptor
Ligand
BDBM50085909
Substrate
Meas. Tech.
ChEMBL_158473 (CHEMBL764131)
IC50
6909.0±n/a nM
Citation
 Wang, YWos, JADirr, MJSoper, DLdeLong, MAMieling, GEDe, BAmburgey, JSSuchanek, EGTaylor, CJ Design and synthesis of 13,14-dihydro prostaglandin F(1alpha) analogues as potent and selective ligands for the human FP receptor. J Med Chem 43:945-52 (2000)  
Target
Name:
Thromboxane A2 receptor
Synonyms:
Prostanoid TP receptor TBXA2R Thromboxane Thromboxane Beta
Type:
Enyzme
Mol. Mass.:
37445.28
Organism:
Homo sapiens (Human)
Description:
P21731
Residue:
343
  
Inhibitor
Name:
BDBM50085909
Synonyms:
7-[3,5-Dihydroxy-2-(3-hydroxy-4-phenoxy-butyl)-cyclopentyl]-heptanoic acid | CHEMBL425681
Type:
Small organic molecule
Emp. Form.:
C22H34O6
Mol. Mass.:
394.5018
SMILES:
O[C@H](CC[C@H]1[C@H](O)C[C@H](O)[C@@H]1CCCCCCC(O)=O)COc1ccccc1
: