Target
Prostaglandin F2-alpha receptor
Ligand
BDBM50085919
Substrate
Meas. Tech.
ChEMBL_158455 (CHEMBL763259)
IC50
11±n/a nM
Citation
 Wang, YWos, JADirr, MJSoper, DLdeLong, MAMieling, GEDe, BAmburgey, JSSuchanek, EGTaylor, CJ Design and synthesis of 13,14-dihydro prostaglandin F(1alpha) analogues as potent and selective ligands for the human FP receptor. J Med Chem 43:945-52 (2000)  
Target
Name:
Prostaglandin F2-alpha receptor
Synonyms:
PF2R_HUMAN PGF2 alpha receptor PTGFR Prostanoid FP receptor
Type:
Enzyme
Mol. Mass.:
40072.29
Organism:
Homo sapiens (Human)
Description:
P43088
Residue:
359
  
Inhibitor
Name:
BDBM50085919
Synonyms:
7-{3,5-Dihydroxy-2-[3-hydroxy-4-(thiophen-2-ylsulfanyl)-butyl]-cyclopentyl}-heptanoic acid | CHEMBL369797
Type:
Small organic molecule
Emp. Form.:
C20H32O5S2
Mol. Mass.:
416.595
SMILES:
OC(CC[C@H]1[C@H](O)C[C@H](O)[C@@H]1CCCCCCC(O)=O)CSc1cccs1
: