Target
Prostaglandin E2 receptor EP1 subtype
Ligand
BDBM50085908
Substrate
Meas. Tech.
ChEMBL_158172 (CHEMBL766135)
IC50
5000±n/a nM
Citation
 Wang, YWos, JADirr, MJSoper, DLdeLong, MAMieling, GEDe, BAmburgey, JSSuchanek, EGTaylor, CJ Design and synthesis of 13,14-dihydro prostaglandin F(1alpha) analogues as potent and selective ligands for the human FP receptor. J Med Chem 43:945-52 (2000)  
Target
Name:
Prostaglandin E2 receptor EP1 subtype
Synonyms:
PE2R1_HUMAN PTGER1 Prostaglandin E2 receptor EP1 subtype Prostanoid EP1 receptor
Type:
Enzyme
Mol. Mass.:
41834.57
Organism:
Homo sapiens (Human)
Description:
P34995
Residue:
402
  
Inhibitor
Name:
BDBM50085908
Synonyms:
7-[3,5-Dihydroxy-2-(3-hydroxy-4-phenylamino-butyl)-cyclopentyl]-heptanoic acid | CHEMBL434173
Type:
Small organic molecule
Emp. Form.:
C22H35NO5
Mol. Mass.:
393.517
SMILES:
OC(CC[C@H]1[C@H](O)C[C@H](O)[C@@H]1CCCCCCC(O)=O)CNc1ccccc1
: