Target
Prostaglandin E2 receptor EP3 subtype
Ligand
BDBM50085919
Substrate
Meas. Tech.
ChEMBL_158314 (CHEMBL763371)
IC50
1000±n/a nM
Citation
 Wang, YWos, JADirr, MJSoper, DLdeLong, MAMieling, GEDe, BAmburgey, JSSuchanek, EGTaylor, CJ Design and synthesis of 13,14-dihydro prostaglandin F(1alpha) analogues as potent and selective ligands for the human FP receptor. J Med Chem 43:945-52 (2000)  
Target
Name:
Prostaglandin E2 receptor EP3 subtype
Synonyms:
PE2R3_HUMAN PGE2-R Prostaglandin E2 receptor Prostaglandin E2 receptor EP3 subtype (EP3) Prostaglandin E2 receptor EP3D subtype (EP3D) | Prostanoid EP3 receptor
Type:
Enzyme
Mol. Mass.:
43335.03
Organism:
Homo sapiens (Human)
Description:
P43115
Residue:
390
  
Inhibitor
Name:
BDBM50085919
Synonyms:
7-{3,5-Dihydroxy-2-[3-hydroxy-4-(thiophen-2-ylsulfanyl)-butyl]-cyclopentyl}-heptanoic acid | CHEMBL369797
Type:
Small organic molecule
Emp. Form.:
C20H32O5S2
Mol. Mass.:
416.595
SMILES:
OC(CC[C@H]1[C@H](O)C[C@H](O)[C@@H]1CCCCCCC(O)=O)CSc1cccs1
: