Target
5-hydroxytryptamine receptor 2C
Ligand
BDBM50086067
Substrate
Meas. Tech.
ChEMBL_2757 (CHEMBL617754)
Ki
0.63±n/a nM
Citation
 Bromidge, SMDabbs, SDavies, DTDavies, SDuckworth, DMForbes, ITGaster, LMHam, PJones, GEKing, FDMulholland, KRSaunders, DVWyman, PABlaney, FEClarke, SEBlackburn, TPHolland, VKennett, GALightowler, SMiddlemiss, DNTrail, BRiley, GJWood, MD Biarylcarbamoylindolines are novel and selective 5-HT(2C) receptor inverse agonists: identification of 5-methyl-1-[[2-[(2-methyl-3-pyridyl)oxy]- 5-pyridyl]carbamoyl]-6-trifluoromethylindoline (SB-243213) as a potential antidepressant/anxiolytic agent. J Med Chem 43:1123-34 (2000)  
Target
Name:
5-hydroxytryptamine receptor 2C
Synonyms:
5-HT-1C 5-HT1C 5-HT2C-INI 5-HTR2C 5-hydroxytryptamine receptor 2C (5-HT-2C) 5HT-1C HTR1C Serotonin (5-HT3) receptor Serotonin Receptor 2C
Type:
G Protein-Coupled Receptor (GPCR)
Mol. Mass.:
51836.79
Organism:
Homo sapiens (Human)
Description:
P28335
Residue:
458
  
Inhibitor
Name:
BDBM50086067
Synonyms:
5-Methoxy-6-trifluoromethyl-2,3-dihydro-indole-1-carboxylic acid [4-chloro-3-(4-methyl-pyridin-3-yl)-phenyl]-amide | CHEMBL14362
Type:
Small organic molecule
Emp. Form.:
C23H19ClF3N3O2
Mol. Mass.:
461.864
SMILES:
COc1cc2CCN(C(=O)Nc3ccc(Cl)c(c3)-c3cnccc3C)c2cc1C(F)(F)F
: