Target
5-hydroxytryptamine receptor 1D
Ligand
BDBM50086111
Substrate
Meas. Tech.
ChEMBL_1975 (CHEMBL617580)
IC50
233±n/a nM
Citation
 Matzen, Lvan Amsterdam, CRautenberg, WGreiner, HEHarting, JSeyfried, CABöttcher, H 5-HT reuptake inhibitors with 5-HT(1B/1D) antagonistic activity: a new approach toward efficient antidepressants. J Med Chem 43:1149-57 (2000)  
Target
Name:
5-hydroxytryptamine receptor 1D
Synonyms:
5-HT-1D 5-hydroxytryptamine receptor 1D Htr1d Serotonin 1B/1D receptor | Serotonin receptor 1D
Type:
Enzyme Catalytic Domain
Mol. Mass.:
41551.75
Organism:
RAT
Description:
5-HT1D HTR1D RAT::P28565
Residue:
374
  
Inhibitor
Name:
BDBM50086111
Synonyms:
4-(1H-Indol-3-yl)-piperidine-1-carboxylic acid [4-methoxy-3-(4-methyl-piperazin-1-yl)-phenyl]-amide | CHEMBL15855
Type:
Small organic molecule
Emp. Form.:
C26H33N5O2
Mol. Mass.:
447.5725
SMILES:
COc1ccc(NC(=O)N2CCC(CC2)c2c[nH]c3ccccc23)cc1N1CCN(C)CC1
: