Target
5-hydroxytryptamine receptor 1B
Ligand
BDBM50086110
Substrate
Meas. Tech.
ChEMBL_1774 (CHEMBL616558)
IC50
233±n/a nM
Citation
 Matzen, Lvan Amsterdam, CRautenberg, WGreiner, HEHarting, JSeyfried, CABöttcher, H 5-HT reuptake inhibitors with 5-HT(1B/1D) antagonistic activity: a new approach toward efficient antidepressants. J Med Chem 43:1149-57 (2000)  
Target
Name:
5-hydroxytryptamine receptor 1B
Synonyms:
5-HT-1B 5-hydroxytryptamine receptor 1B (5HT1B) 5ht1b Serotonin 1 (5-HT1) receptor Serotonin receptor 1B
Type:
Protein
Mol. Mass.:
43173.33
Organism:
Rattus norvegicus (Rat)
Description:
P28564
Residue:
386
  
Inhibitor
Name:
BDBM50086110
Synonyms:
3-(5-Fluoro-1H-indol-3-yl)-pyrrolidine-1-carboxylic acid [4-methoxy-3-(4-methyl-piperazin-1-yl)-phenyl]-amide | CHEMBL279646
Type:
Small organic molecule
Emp. Form.:
C25H30FN5O2
Mol. Mass.:
451.5364
SMILES:
COc1ccc(NC(=O)N2CCC(C2)c2c[nH]c3ccc(F)cc23)cc1N1CCN(C)CC1
: