Target
5-hydroxytryptamine receptor 1A
Ligand
BDBM50086101
Substrate
Meas. Tech.
ChEMBL_843 (CHEMBL615406)
IC50
50±n/a nM
Citation
 Matzen, Lvan Amsterdam, CRautenberg, WGreiner, HEHarting, JSeyfried, CABöttcher, H 5-HT reuptake inhibitors with 5-HT(1B/1D) antagonistic activity: a new approach toward efficient antidepressants. J Med Chem 43:1149-57 (2000)  
Target
Name:
5-hydroxytryptamine receptor 1A
Synonyms:
5-HT-1A 5-HT1A 5-hydroxytryptamine receptor 1A (5HT1A) 5ht1a Htr1a Serotonin 1a (5-HT1a) receptor/Adrenergic receptor alpha-1 | Serotonin receptor 1A
Type:
G Protein-Coupled Receptor (GPCR)
Mol. Mass.:
46445.29
Organism:
Rattus norvegicus (rat)
Description:
Binding assays were performed using rat hippocampal membranes.
Residue:
422
  
Inhibitor
Name:
BDBM50086101
Synonyms:
4-[4-(5-Fluoro-1H-indol-3-yl)-butyl]-piperazine-1-carboxylic acid [4-methoxy-3-(4-methyl-piperazin-1-yl)-phenyl]-amide | CHEMBL15837
Type:
Small organic molecule
Emp. Form.:
C29H39FN6O2
Mol. Mass.:
522.6574
SMILES:
COc1ccc(NC(=O)N2CCN(CCCCc3c[nH]c4ccc(F)cc34)CC2)cc1N1CCN(C)CC1
: