Target
Adenosine receptor A3
Ligand
BDBM50086170
Substrate
Meas. Tech.
ChEMBL_31993 (CHEMBL646441)
Ki
570±n/a nM
Citation
 Kim, YCJi, XMelman, NLinden, JJacobson, KA Anilide derivatives of an 8-phenylxanthine carboxylic congener are highly potent and selective antagonists at human A(2B) adenosine receptors. J Med Chem 43:1165-72 (2000)  
Target
Name:
Adenosine receptor A3
Synonyms:
A3 adenosine receptor (hA3) ADORA3 | Adenosine A3 receptor (A3AR)
Type:
G Protein-Coupled Receptor (GPCR)
Mol. Mass.:
36197.32
Organism:
Homo sapiens (Human)
Description:
P0DMS8
Residue:
318
  
Inhibitor
Name:
BDBM50086170
Synonyms:
(4-Cyano-phenyl)-carbamic acid 4-(2,6-dioxo-1,3-dipropyl-2,3,6,7-tetrahydro-1H-purin-8-yl)-phenyl ester CHEMBL273807 N-(4-Cyano-phenyl)-2-[4-(2,6-dioxo-1,3-dipropyl-2,3,6,7-tetrahydro-1H-purin-8-yl)-phenoxy]-acetamide(MRS-1754) | N-(4-cyanophenyl)-2-(4-(2,6-dioxo-1,3-dipropyl-2,3,6,7-tetrahydro-1H-purin-8-yl)phenoxy)acetamide
Type:
Small organic molecule
Emp. Form.:
C26H26N6O4
Mol. Mass.:
486.5224
SMILES:
CCCn1c2nc([nH]c2c(=O)n(CCC)c1=O)-c1ccc(OCC(=O)Nc2ccc(cc2)C#N)cc1
: