Target
Cytochrome P450 3A4
Ligand
BDBM50531003
Substrate
Meas. Tech.
ChEMBL_1914337 (CHEMBL4416920)
IC50
4700±n/a nM
Citation
 Adebesin, AMWesser, TVijaykumar, JKonkel, APaudyal, MPLossie, JZhu, CWestphal, CPuli, NFischer, RSchunck, WHFalck, JR Development of Robust 17( J Med Chem 62:10124-10143 (2019)  
Target
Name:
Cytochrome P450 3A4
Synonyms:
Albendazole monooxygenase CP3A4_HUMAN CYP3A4 CYPIIIA4 Cytochrome P450 3A4 (CYP3A4) Nifedipine oxidase Taurochenodeoxycholate 6-alpha-hydroxylase
Type:
Enzyme
Mol. Mass.:
57349.57
Organism:
Homo sapiens (Human)
Description:
Residue:
503
  
Inhibitor
Name:
BDBM50531003
Synonyms:
CHEMBL4463477
Type:
Small organic molecule
Emp. Form.:
C19H34N6O2
Mol. Mass.:
378.5123
SMILES:
CNC(=O)C(=O)NCCCC\C=C/CCCCCCCCCc1nnn[nH]1
: