Target
Cytochrome P450 2C8
Ligand
BDBM50531005
Substrate
Meas. Tech.
ChEMBL_1914333 (CHEMBL4416916)
IC50
>50000±n/a nM
Citation
 Adebesin, AMWesser, TVijaykumar, JKonkel, APaudyal, MPLossie, JZhu, CWestphal, CPuli, NFischer, RSchunck, WHFalck, JR Development of Robust 17( J Med Chem 62:10124-10143 (2019)  
Target
Name:
Cytochrome P450 2C8
Synonyms:
CP2C8_HUMAN CYPIIC8 P450 IIC2 P450 form 1 | S-mephenytoin 4-hydroxylase
Type:
Protein
Mol. Mass.:
55839.23
Organism:
Homo sapiens (Human)
Description:
P10632
Residue:
490
  
Inhibitor
Name:
BDBM50531005
Synonyms:
CHEMBL4473988
Type:
Small organic molecule
Emp. Form.:
C18H32N2O5
Mol. Mass.:
356.4571
SMILES:
CNC(=O)C(=O)NCCCC\C=C/CCCCCCCOCC(O)=O
: