Target
Cytochrome P450 2C9
Ligand
BDBM50531003
Substrate
Meas. Tech.
ChEMBL_1914334 (CHEMBL4416917)
IC50
5400±n/a nM
Citation
 Adebesin, AMWesser, TVijaykumar, JKonkel, APaudyal, MPLossie, JZhu, CWestphal, CPuli, NFischer, RSchunck, WHFalck, JR Development of Robust 17( J Med Chem 62:10124-10143 (2019)  
Target
Name:
Cytochrome P450 2C9
Synonyms:
(R)-limonene 6-monooxygenase CP2C9_HUMAN CYP2C9 Cytochrome P450 2C9 (CYP2C9 ) P-450MP P450 PB-1 | S-mephenytoin 4-hydroxylase
Type:
Enzyme
Mol. Mass.:
55636.33
Organism:
Homo sapiens (Human)
Description:
P11712
Residue:
490
  
Inhibitor
Name:
BDBM50531003
Synonyms:
CHEMBL4463477
Type:
Small organic molecule
Emp. Form.:
C19H34N6O2
Mol. Mass.:
378.5123
SMILES:
CNC(=O)C(=O)NCCCC\C=C/CCCCCCCCCc1nnn[nH]1
: