Target
Cytochrome P450 2D6
Ligand
BDBM50531003
Substrate
Meas. Tech.
ChEMBL_1914336 (CHEMBL4416919)
IC50
43200±n/a nM
Citation
 Adebesin, AMWesser, TVijaykumar, JKonkel, APaudyal, MPLossie, JZhu, CWestphal, CPuli, NFischer, RSchunck, WHFalck, JR Development of Robust 17( J Med Chem 62:10124-10143 (2019)  
Target
Name:
Cytochrome P450 2D6
Synonyms:
CP2D6_HUMAN CYP2DL1 Cytochrome P450 2D6 (CYP2D6) P450-DB1
Type:
Protein
Mol. Mass.:
55774.82
Organism:
Homo sapiens (Human)
Description:
P10635
Residue:
497
  
Inhibitor
Name:
BDBM50531003
Synonyms:
CHEMBL4463477
Type:
Small organic molecule
Emp. Form.:
C19H34N6O2
Mol. Mass.:
378.5123
SMILES:
CNC(=O)C(=O)NCCCC\C=C/CCCCCCCCCc1nnn[nH]1
: