Target
Cytochrome P450 1A2
Ligand
BDBM50531003
Substrate
Meas. Tech.
ChEMBL_1914331 (CHEMBL4416914)
IC50
>50000±n/a nM
Citation
 Adebesin, AMWesser, TVijaykumar, JKonkel, APaudyal, MPLossie, JZhu, CWestphal, CPuli, NFischer, RSchunck, WHFalck, JR Development of Robust 17( J Med Chem 62:10124-10143 (2019)  
Target
Name:
Cytochrome P450 1A2
Synonyms:
CP1A2_HUMAN CYPIA2 Cytochrome P(3)450 Cytochrome P450 1A2 (CYP1A2) Cytochrome P450-P3
Type:
Enzyme
Mol. Mass.:
58423.38
Organism:
Homo sapiens (Human)
Description:
P05177
Residue:
516
  
Inhibitor
Name:
BDBM50531003
Synonyms:
CHEMBL4463477
Type:
Small organic molecule
Emp. Form.:
C19H34N6O2
Mol. Mass.:
378.5123
SMILES:
CNC(=O)C(=O)NCCCC\C=C/CCCCCCCCCc1nnn[nH]1
: